Information card for entry 7057337
Formula | C34 H25 N6 O9 Zn |
Calculated formula | C34 H25 N6 O9 Zn |
Title of publication | Structure, sensing and photocatalytic properties of two multifunctional 3D luminescent coordination polymers based on an N-heterocyclic carboxylic acid |
Authors of publication | Zong, Ziao; Bi, Caifeng; Zhu, Zheng; Fan, Chuanbin; Meng, Xiangmin; Zhang, Xia; Fan, Yuhua |
Journal of publication | New Journal of Chemistry |
Year of publication | 2018 |
Journal volume | 42 |
Journal issue | 11 |
Pages of publication | 8905 |
a | 11.3666 ± 0.0016 Å |
b | 14.999 ± 0.002 Å |
c | 22.353 ± 0.003 Å |
α | 90° |
β | 102.602 ± 0.009° |
γ | 90° |
Cell volume | 3719.1 ± 0.9 Å3 |
Cell temperature | 296 K |
Ambient diffraction temperature | 296.15 K |
Number of distinct elements | 5 |
Space group number | 13 |
Hermann-Mauguin space group symbol | P 1 2/n 1 |
Hall space group symbol | -P 2yac |
Residual factor for all reflections | 0.1076 |
Residual factor for significantly intense reflections | 0.0501 |
Weighted residual factors for significantly intense reflections | 0.1045 |
Weighted residual factors for all reflections included in the refinement | 0.1222 |
Goodness-of-fit parameter for all reflections included in the refinement | 0.963 |
Diffraction radiation wavelength | 0.71073 Å |
Diffraction radiation type | MoKα |