Information card for entry 7057338
Formula | C43 H28 N7 O4 Zn |
Calculated formula | C43 H28 N7 O4 Zn |
Title of publication | Structure, sensing and photocatalytic properties of two multifunctional 3D luminescent coordination polymers based on an N-heterocyclic carboxylic acid |
Authors of publication | Zong, Ziao; Bi, Caifeng; Zhu, Zheng; Fan, Chuanbin; Meng, Xiangmin; Zhang, Xia; Fan, Yuhua |
Journal of publication | New Journal of Chemistry |
Year of publication | 2018 |
Journal volume | 42 |
Journal issue | 11 |
Pages of publication | 8905 |
a | 26.411 ± 0.003 Å |
b | 9.7562 ± 0.0011 Å |
c | 32.752 ± 0.004 Å |
α | 90° |
β | 108.25 ± 0.003° |
γ | 90° |
Cell volume | 8014.7 ± 1.6 Å3 |
Cell temperature | 205 K |
Ambient diffraction temperature | 205 K |
Number of distinct elements | 5 |
Space group number | 15 |
Hermann-Mauguin space group symbol | C 1 2/c 1 |
Hall space group symbol | -C 2yc |
Residual factor for all reflections | 0.1071 |
Residual factor for significantly intense reflections | 0.0809 |
Weighted residual factors for significantly intense reflections | 0.231 |
Weighted residual factors for all reflections included in the refinement | 0.2471 |
Goodness-of-fit parameter for all reflections included in the refinement | 1.108 |
Diffraction radiation wavelength | 0.71073 Å |
Diffraction radiation type | MoKα |