Information card for entry 7057343
Common name | barium tetranitroplatinate(II) trihydrate |
Chemical name | barium tetranitroplatinate(II) trihydrate |
Formula | Ba H6 N4 O11 Pt |
Calculated formula | Ba H6 N4 O11 Pt |
Title of publication | Complex salts of Pd(ii) and Pt(ii) with Co(ii) and Ni(ii) aqua-cations as single-source precursors for bimetallic nanoalloys and mixed oxides |
Authors of publication | Zadesenets, Andrey V.; Filatov, Evgeniy Yu.; Plyusnin, Pavel E.; Asanova, Tatyana I.; Korolkov, Ilya V.; Baidina, Iraida A.; Shlyakhova, Elena V.; Asanov, Igor P.; Korenev, Sergey V. |
Journal of publication | New Journal of Chemistry |
Year of publication | 2018 |
Journal volume | 42 |
Journal issue | 11 |
Pages of publication | 8843 |
a | 8.3841 ± 0.0007 Å |
b | 8.422 ± 0.0007 Å |
c | 9.5643 ± 0.0008 Å |
α | 81.036 ± 0.002° |
β | 71.001 ± 0.002° |
γ | 60.479 ± 0.002° |
Cell volume | 555.65 ± 0.08 Å3 |
Cell temperature | 296 ± 2 K |
Ambient diffraction temperature | 296 ± 2 K |
Number of distinct elements | 5 |
Space group number | 2 |
Hermann-Mauguin space group symbol | P -1 |
Hall space group symbol | -P 1 |
Residual factor for all reflections | 0.0157 |
Residual factor for significantly intense reflections | 0.0152 |
Weighted residual factors for significantly intense reflections | 0.0378 |
Weighted residual factors for all reflections included in the refinement | 0.038 |
Goodness-of-fit parameter for all reflections included in the refinement | 1.072 |
Diffraction radiation wavelength | 0.71073 Å |
Diffraction radiation type | MoKα |