Information card for entry 7057342
Common name | cobalt(II) nitropalladate octahydrate |
Chemical name | hexaaquacobalt(II) tetranitropalladate(II) dihydrate |
Formula | Co H16 N4 O16 Pd |
Calculated formula | Co H16 N4 O16 Pd |
Title of publication | Complex salts of Pd(ii) and Pt(ii) with Co(ii) and Ni(ii) aqua-cations as single-source precursors for bimetallic nanoalloys and mixed oxides |
Authors of publication | Zadesenets, Andrey V.; Filatov, Evgeniy Yu.; Plyusnin, Pavel E.; Asanova, Tatyana I.; Korolkov, Ilya V.; Baidina, Iraida A.; Shlyakhova, Elena V.; Asanov, Igor P.; Korenev, Sergey V. |
Journal of publication | New Journal of Chemistry |
Year of publication | 2018 |
Journal volume | 42 |
Journal issue | 11 |
Pages of publication | 8843 |
a | 6.0051 ± 0.0003 Å |
b | 7.8865 ± 0.0004 Å |
c | 8.6872 ± 0.0005 Å |
α | 110.055 ± 0.002° |
β | 105.1 ± 0.003° |
γ | 96.203 ± 0.003° |
Cell volume | 364.18 ± 0.03 Å3 |
Cell temperature | 296 ± 2 K |
Ambient diffraction temperature | 296 ± 2 K |
Number of distinct elements | 5 |
Space group number | 1 |
Hermann-Mauguin space group symbol | P 1 |
Hall space group symbol | P 1 |
Residual factor for all reflections | 0.0248 |
Residual factor for significantly intense reflections | 0.0211 |
Weighted residual factors for significantly intense reflections | 0.0481 |
Weighted residual factors for all reflections included in the refinement | 0.0495 |
Goodness-of-fit parameter for all reflections included in the refinement | 1.012 |
Diffraction radiation wavelength | 0.71073 Å |
Diffraction radiation type | MoKα |