Information card for entry 7058772
Formula | C22 H16 O Se |
Calculated formula | C22 H16 O Se |
Title of publication | Nature of the E⋯E′ interactions (E, E′ = O, S, Se, and Te) at naphthalene 1,8-positions with fine details of the structures: experimental and theoretical investigations |
Authors of publication | Hayashi, Satoko; Uegaito, Manabu; Nishide, Taro; Tanaka, Eiichiro; Nakanishi, Waro; Sasamori, Takahiro; Tokitoh, Norihiro; Minoura, Mao |
Journal of publication | New Journal of Chemistry |
Year of publication | 2019 |
Journal volume | 43 |
Journal issue | 36 |
Pages of publication | 14224 |
a | 8.1621 ± 0.0001 Å |
b | 15.639 ± 0.0003 Å |
c | 13.0768 ± 0.0003 Å |
α | 90° |
β | 92.5953 ± 0.0007° |
γ | 90° |
Cell volume | 1667.5 ± 0.05 Å3 |
Cell temperature | 103 ± 2 K |
Ambient diffraction temperature | 103 ± 2 K |
Number of distinct elements | 4 |
Space group number | 14 |
Hermann-Mauguin space group symbol | P 1 21/c 1 |
Hall space group symbol | -P 2ybc |
Residual factor for all reflections | 0.0437 |
Residual factor for significantly intense reflections | 0.0379 |
Weighted residual factors for significantly intense reflections | 0.113 |
Weighted residual factors for all reflections included in the refinement | 0.1213 |
Goodness-of-fit parameter for all reflections included in the refinement | 1.203 |
Diffraction radiation wavelength | 0.71069 Å |
Diffraction radiation type | MoKα |