Information card for entry 7058773
Formula | C22 H16 Se Te |
Calculated formula | C22 H16 Se Te |
Title of publication | Nature of the E⋯E′ interactions (E, E′ = O, S, Se, and Te) at naphthalene 1,8-positions with fine details of the structures: experimental and theoretical investigations |
Authors of publication | Hayashi, Satoko; Uegaito, Manabu; Nishide, Taro; Tanaka, Eiichiro; Nakanishi, Waro; Sasamori, Takahiro; Tokitoh, Norihiro; Minoura, Mao |
Journal of publication | New Journal of Chemistry |
Year of publication | 2019 |
Journal volume | 43 |
Journal issue | 36 |
Pages of publication | 14224 |
a | 10.0676 ± 0.0004 Å |
b | 11.2431 ± 0.0004 Å |
c | 18.051 ± 0.0008 Å |
α | 73.895 ± 0.001° |
β | 86.942 ± 0.002° |
γ | 67.067 ± 0.001° |
Cell volume | 1804.41 ± 0.13 Å3 |
Cell temperature | 110 ± 2 K |
Ambient diffraction temperature | 110 ± 2 K |
Number of distinct elements | 4 |
Space group number | 2 |
Hermann-Mauguin space group symbol | P -1 |
Hall space group symbol | -P 1 |
Residual factor for all reflections | 0.0234 |
Residual factor for significantly intense reflections | 0.0215 |
Weighted residual factors for significantly intense reflections | 0.0516 |
Weighted residual factors for all reflections included in the refinement | 0.0527 |
Goodness-of-fit parameter for all reflections included in the refinement | 1.327 |
Diffraction radiation wavelength | 0.71073 Å |
Diffraction radiation type | MoKα |