Information card for entry 7058785
Formula | C15 H30 O18 Sm2 |
Calculated formula | C15 H30 O18 Sm2 |
Title of publication | Magnetic, luminescence, topological and theoretical studies of structurally diverse supramolecular lanthanide coordination polymers with flexible glutaric acid as a linker |
Authors of publication | Kumar, Manesh; Qiu, Cheng-Qiang; Zaręba, Jan K.; Frontera, Antonio; Jassal, Amanpreet Kaur; Sahoo, Subash Chandra; Liu, Sui-Jun; Sheikh, Haq Nawaz |
Journal of publication | New Journal of Chemistry |
Year of publication | 2019 |
Journal volume | 43 |
Journal issue | 36 |
Pages of publication | 14546 |
a | 8.0028 ± 0.0005 Å |
b | 15.0146 ± 0.0009 Å |
c | 19.6729 ± 0.0012 Å |
α | 90° |
β | 93.991 ± 0.002° |
γ | 90° |
Cell volume | 2358.1 ± 0.2 Å3 |
Cell temperature | 296 ± 2 K |
Ambient diffraction temperature | 296 ± 2 K |
Number of distinct elements | 4 |
Space group number | 15 |
Hermann-Mauguin space group symbol | C 1 2/c 1 |
Hall space group symbol | -C 2yc |
Residual factor for all reflections | 0.0298 |
Residual factor for significantly intense reflections | 0.0281 |
Weighted residual factors for significantly intense reflections | 0.0683 |
Weighted residual factors for all reflections included in the refinement | 0.0694 |
Goodness-of-fit parameter for all reflections included in the refinement | 1.155 |
Diffraction radiation wavelength | 0.71073 Å |
Diffraction radiation type | MoKα |