Information card for entry 7058786
Formula | C15 H22 Eu2 O14 |
Calculated formula | C15 H22 Eu2 O14 |
Title of publication | Magnetic, luminescence, topological and theoretical studies of structurally diverse supramolecular lanthanide coordination polymers with flexible glutaric acid as a linker |
Authors of publication | Kumar, Manesh; Qiu, Cheng-Qiang; Zaręba, Jan K.; Frontera, Antonio; Jassal, Amanpreet Kaur; Sahoo, Subash Chandra; Liu, Sui-Jun; Sheikh, Haq Nawaz |
Journal of publication | New Journal of Chemistry |
Year of publication | 2019 |
Journal volume | 43 |
Journal issue | 36 |
Pages of publication | 14546 |
a | 7.9832 ± 0.0001 Å |
b | 15.0012 ± 0.0003 Å |
c | 19.6694 ± 0.0004 Å |
α | 90° |
β | 94.119 ± 0.002° |
γ | 90° |
Cell volume | 2349.48 ± 0.07 Å3 |
Cell temperature | 293 K |
Ambient diffraction temperature | 293 K |
Number of distinct elements | 4 |
Space group number | 15 |
Hermann-Mauguin space group symbol | C 1 2/c 1 |
Hall space group symbol | -C 2yc |
Residual factor for all reflections | 0.0363 |
Residual factor for significantly intense reflections | 0.0354 |
Weighted residual factors for significantly intense reflections | 0.095 |
Weighted residual factors for all reflections included in the refinement | 0.0955 |
Goodness-of-fit parameter for all reflections included in the refinement | 1.009 |
Diffraction radiation probe | x-ray |
Diffraction radiation wavelength | 0.71073 Å |
Diffraction radiation type | MoKα |