Information card for entry 7058787
Formula | C15 H26 Gd2 O16 |
Calculated formula | C15 H26 Gd2 O16 |
Title of publication | Magnetic, luminescence, topological and theoretical studies of structurally diverse supramolecular lanthanide coordination polymers with flexible glutaric acid as a linker |
Authors of publication | Kumar, Manesh; Qiu, Cheng-Qiang; Zaręba, Jan K.; Frontera, Antonio; Jassal, Amanpreet Kaur; Sahoo, Subash Chandra; Liu, Sui-Jun; Sheikh, Haq Nawaz |
Journal of publication | New Journal of Chemistry |
Year of publication | 2019 |
Journal volume | 43 |
Journal issue | 36 |
Pages of publication | 14546 |
a | 8.7718 ± 0.0007 Å |
b | 14.1478 ± 0.0011 Å |
c | 23.0016 ± 0.0019 Å |
α | 90° |
β | 90° |
γ | 90° |
Cell volume | 2854.5 ± 0.4 Å3 |
Cell temperature | 297 ± 2 K |
Ambient diffraction temperature | 297.25 K |
Number of distinct elements | 4 |
Space group number | 19 |
Hermann-Mauguin space group symbol | P 21 21 21 |
Hall space group symbol | P 2ac 2ab |
Residual factor for all reflections | 0.0699 |
Residual factor for significantly intense reflections | 0.0545 |
Weighted residual factors for significantly intense reflections | 0.1446 |
Weighted residual factors for all reflections included in the refinement | 0.1526 |
Goodness-of-fit parameter for all reflections included in the refinement | 1.052 |
Diffraction radiation wavelength | 0.71073 Å |
Diffraction radiation type | MoKα |