Information card for entry 7058791
Formula | C18 H29 N O15 Pr2 |
Calculated formula | C18 H29 N O15 Pr2 |
Title of publication | Magnetic, luminescence, topological and theoretical studies of structurally diverse supramolecular lanthanide coordination polymers with flexible glutaric acid as a linker |
Authors of publication | Kumar, Manesh; Qiu, Cheng-Qiang; Zaręba, Jan K.; Frontera, Antonio; Jassal, Amanpreet Kaur; Sahoo, Subash Chandra; Liu, Sui-Jun; Sheikh, Haq Nawaz |
Journal of publication | New Journal of Chemistry |
Year of publication | 2019 |
Journal volume | 43 |
Journal issue | 36 |
Pages of publication | 14546 |
a | 13.7 ± 0.006 Å |
b | 13.662 ± 0.006 Å |
c | 15.835 ± 0.007 Å |
α | 90° |
β | 114.812 ± 0.01° |
γ | 90° |
Cell volume | 2690 ± 2 Å3 |
Cell temperature | 302 ± 2 K |
Ambient diffraction temperature | 302.27 K |
Number of distinct elements | 5 |
Space group number | 14 |
Hermann-Mauguin space group symbol | P 1 21/c 1 |
Hall space group symbol | -P 2ybc |
Residual factor for all reflections | 0.0236 |
Residual factor for significantly intense reflections | 0.0207 |
Weighted residual factors for significantly intense reflections | 0.0514 |
Weighted residual factors for all reflections included in the refinement | 0.0532 |
Goodness-of-fit parameter for all reflections included in the refinement | 1.133 |
Diffraction radiation wavelength | 0.71073 Å |
Diffraction radiation type | MoKα |