Information card for entry 7058792
Common name | EuFtpyttfa3 |
Formula | C43 H25 Eu F9 N3 O7 S3 |
Calculated formula | C42.996 H24.997 Eu F9 N3 O7 S2.999 |
Title of publication | Luminescent europium(iii) and terbium(iii) complexes of β-diketonate and substituted terpyridine ligands: synthesis, crystal structures and elucidation of energy transfer pathways |
Authors of publication | Abbas, Zafar; Dasari, Srikanth; Beltrán-Leiva, María J.; Cantero-López, Plinio; Páez-Hernández, Dayán; Arratia-Pérez, Ramiro; Butcher, Ray J.; Patra, Ashis K. |
Journal of publication | New Journal of Chemistry |
Year of publication | 2019 |
Journal volume | 43 |
Journal issue | 38 |
Pages of publication | 15139 |
a | 9.7332 ± 0.001 Å |
b | 12.2332 ± 0.0012 Å |
c | 19.732 ± 0.002 Å |
α | 87.425 ± 0.003° |
β | 79.918 ± 0.003° |
γ | 70.531 ± 0.003° |
Cell volume | 2180.7 ± 0.4 Å3 |
Cell temperature | 100 ± 2 K |
Ambient diffraction temperature | 100 ± 2 K |
Number of distinct elements | 7 |
Space group number | 2 |
Hermann-Mauguin space group symbol | P -1 |
Hall space group symbol | -P 1 |
Residual factor for all reflections | 0.1401 |
Residual factor for significantly intense reflections | 0.0695 |
Weighted residual factors for significantly intense reflections | 0.1381 |
Weighted residual factors for all reflections included in the refinement | 0.1618 |
Goodness-of-fit parameter for all reflections included in the refinement | 1.027 |
Diffraction radiation wavelength | 0.71073 Å |
Diffraction radiation type | MoKα |