Information card for entry 7058795
Common name | TbFtpyttfa3 |
Formula | C43 H25 F9 N3 O7 S3 Tb |
Calculated formula | C43.004 H25.003 F9 N3 O7 S3.001 Tb |
Title of publication | Luminescent europium(iii) and terbium(iii) complexes of β-diketonate and substituted terpyridine ligands: synthesis, crystal structures and elucidation of energy transfer pathways |
Authors of publication | Abbas, Zafar; Dasari, Srikanth; Beltrán-Leiva, María J.; Cantero-López, Plinio; Páez-Hernández, Dayán; Arratia-Pérez, Ramiro; Butcher, Ray J.; Patra, Ashis K. |
Journal of publication | New Journal of Chemistry |
Year of publication | 2019 |
Journal volume | 43 |
Journal issue | 38 |
Pages of publication | 15139 |
a | 9.8018 ± 0.0007 Å |
b | 12.1508 ± 0.0009 Å |
c | 19.6217 ± 0.0014 Å |
α | 87.327 ± 0.002° |
β | 79.983 ± 0.002° |
γ | 70.536 ± 0.002° |
Cell volume | 2169.6 ± 0.3 Å3 |
Cell temperature | 100 ± 2 K |
Ambient diffraction temperature | 100 ± 2 K |
Number of distinct elements | 7 |
Space group number | 2 |
Hermann-Mauguin space group symbol | P -1 |
Hall space group symbol | -P 1 |
Residual factor for all reflections | 0.1436 |
Residual factor for significantly intense reflections | 0.0742 |
Weighted residual factors for significantly intense reflections | 0.1617 |
Weighted residual factors for all reflections included in the refinement | 0.1867 |
Goodness-of-fit parameter for all reflections included in the refinement | 1.039 |
Diffraction radiation wavelength | 0.71073 Å |
Diffraction radiation type | MoKα |