Information card for entry 7058794
Common name | Tbstpyttfa3 |
Formula | C43 H25 F9 N3 O6 S4 Tb |
Calculated formula | C43 H25 F9 N3 O6 S4 Tb |
Title of publication | Luminescent europium(iii) and terbium(iii) complexes of β-diketonate and substituted terpyridine ligands: synthesis, crystal structures and elucidation of energy transfer pathways |
Authors of publication | Abbas, Zafar; Dasari, Srikanth; Beltrán-Leiva, María J.; Cantero-López, Plinio; Páez-Hernández, Dayán; Arratia-Pérez, Ramiro; Butcher, Ray J.; Patra, Ashis K. |
Journal of publication | New Journal of Chemistry |
Year of publication | 2019 |
Journal volume | 43 |
Journal issue | 38 |
Pages of publication | 15139 |
a | 9.863 ± 0.0006 Å |
b | 12.2319 ± 0.0007 Å |
c | 19.6295 ± 0.0012 Å |
α | 87.955 ± 0.001° |
β | 80.144 ± 0.002° |
γ | 69.849 ± 0.001° |
Cell volume | 2189.7 ± 0.2 Å3 |
Cell temperature | 100 ± 2 K |
Ambient diffraction temperature | 100 ± 2 K |
Number of distinct elements | 7 |
Space group number | 2 |
Hermann-Mauguin space group symbol | P -1 |
Hall space group symbol | -P 1 |
Residual factor for all reflections | 0.0627 |
Residual factor for significantly intense reflections | 0.052 |
Weighted residual factors for significantly intense reflections | 0.1323 |
Weighted residual factors for all reflections included in the refinement | 0.1397 |
Goodness-of-fit parameter for all reflections included in the refinement | 1.047 |
Diffraction radiation wavelength | 0.71073 Å |
Diffraction radiation type | MoKα |