Information card for entry 7058814
Formula | C36 H46 N2 O2 P2 Pt |
Calculated formula | C36 H46 N2 O2 P2 Pt |
Title of publication | Reactivities of zero-valent group 10 complexes toward organic isocyanates: synthesis of metallacycles containing dimeric isocyanate units, isocyanate cyclotrimerization, and computational chemistry |
Authors of publication | Han, Young-Sung; Jung, Kang-Yeoun; Kim, Yong-Joo; Baeck, Kyoung Koo; Lee, Gang Min; Lee, Soon W. |
Journal of publication | New Journal of Chemistry |
Year of publication | 2019 |
Journal volume | 43 |
Journal issue | 39 |
Pages of publication | 15614 |
a | 8.6581 ± 0.0009 Å |
b | 17.404 ± 0.002 Å |
c | 22.735 ± 0.003 Å |
α | 90° |
β | 90° |
γ | 90° |
Cell volume | 3425.8 ± 0.7 Å3 |
Cell temperature | 223 ± 2 K |
Ambient diffraction temperature | 223 ± 2 K |
Number of distinct elements | 6 |
Space group number | 19 |
Hermann-Mauguin space group symbol | P 21 21 21 |
Hall space group symbol | P 2ac 2ab |
Residual factor for all reflections | 0.053 |
Residual factor for significantly intense reflections | 0.0334 |
Weighted residual factors for significantly intense reflections | 0.0527 |
Weighted residual factors for all reflections included in the refinement | 0.0575 |
Goodness-of-fit parameter for all reflections included in the refinement | 1.051 |
Diffraction radiation wavelength | 0.71073 Å |
Diffraction radiation type | MoKα |