Information card for entry 7058815
Formula | C36 H46 N2 O2 P2 Pt |
Calculated formula | C36 H45.448 N2 O2 P2 Pt |
Title of publication | Reactivities of zero-valent group 10 complexes toward organic isocyanates: synthesis of metallacycles containing dimeric isocyanate units, isocyanate cyclotrimerization, and computational chemistry |
Authors of publication | Han, Young-Sung; Jung, Kang-Yeoun; Kim, Yong-Joo; Baeck, Kyoung Koo; Lee, Gang Min; Lee, Soon W. |
Journal of publication | New Journal of Chemistry |
Year of publication | 2019 |
Journal volume | 43 |
Journal issue | 39 |
Pages of publication | 15614 |
a | 8.6475 ± 0.0003 Å |
b | 17.3751 ± 0.0007 Å |
c | 22.7043 ± 0.001 Å |
α | 90° |
β | 90° |
γ | 90° |
Cell volume | 3411.3 ± 0.2 Å3 |
Cell temperature | 223 ± 2 K |
Ambient diffraction temperature | 223 ± 2 K |
Number of distinct elements | 6 |
Space group number | 19 |
Hermann-Mauguin space group symbol | P 21 21 21 |
Hall space group symbol | P 2ac 2ab |
Residual factor for all reflections | 0.0514 |
Residual factor for significantly intense reflections | 0.0317 |
Weighted residual factors for significantly intense reflections | 0.047 |
Weighted residual factors for all reflections included in the refinement | 0.0518 |
Goodness-of-fit parameter for all reflections included in the refinement | 1.066 |
Diffraction radiation wavelength | 0.71073 Å |
Diffraction radiation type | MoKα |