Information card for entry 7058816
Formula | C20 H24 F4 N2 O2 P2 Pt |
Calculated formula | C20 H24 F4 N2 O2 P2 Pt |
Title of publication | Reactivities of zero-valent group 10 complexes toward organic isocyanates: synthesis of metallacycles containing dimeric isocyanate units, isocyanate cyclotrimerization, and computational chemistry |
Authors of publication | Han, Young-Sung; Jung, Kang-Yeoun; Kim, Yong-Joo; Baeck, Kyoung Koo; Lee, Gang Min; Lee, Soon W. |
Journal of publication | New Journal of Chemistry |
Year of publication | 2019 |
Journal volume | 43 |
Journal issue | 39 |
Pages of publication | 15614 |
a | 20.3247 ± 0.0006 Å |
b | 10.1709 ± 0.0003 Å |
c | 23.0532 ± 0.0006 Å |
α | 90° |
β | 90° |
γ | 90° |
Cell volume | 4765.6 ± 0.2 Å3 |
Cell temperature | 223 ± 2 K |
Ambient diffraction temperature | 223 ± 2 K |
Number of distinct elements | 7 |
Space group number | 29 |
Hermann-Mauguin space group symbol | P c a 21 |
Hall space group symbol | P 2c -2ac |
Residual factor for all reflections | 0.0281 |
Residual factor for significantly intense reflections | 0.0223 |
Weighted residual factors for significantly intense reflections | 0.0491 |
Weighted residual factors for all reflections included in the refinement | 0.0513 |
Goodness-of-fit parameter for all reflections included in the refinement | 1.081 |
Diffraction radiation wavelength | 0.71073 Å |
Diffraction radiation type | MoKα |