Information card for entry 7058830
Formula | C27 H15 Cd3 N6 O13 |
Calculated formula | C27 H15 Cd3 N6 O13 |
Title of publication | Two mixed-ligand Cd(ii)‒organic frameworks with unique topologies: selective luminescence sensing of TNP and Cu2+ ions with recyclable performances |
Authors of publication | Zhang, Jinfang; Jia, Wen; Wu, Junjie; Tang, Guodong; Zhang, Chi |
Journal of publication | New Journal of Chemistry |
Year of publication | 2019 |
Journal volume | 43 |
Journal issue | 40 |
Pages of publication | 16078 |
a | 9.1768 ± 0.0003 Å |
b | 12.5169 ± 0.0004 Å |
c | 12.873 ± 0.0004 Å |
α | 66.876 ± 0.002° |
β | 80.97 ± 0.002° |
γ | 78.661 ± 0.002° |
Cell volume | 1328.09 ± 0.08 Å3 |
Cell temperature | 150 ± 2 K |
Ambient diffraction temperature | 150 ± 2 K |
Number of distinct elements | 5 |
Space group number | 2 |
Hermann-Mauguin space group symbol | P -1 |
Hall space group symbol | -P 1 |
Residual factor for all reflections | 0.0641 |
Residual factor for significantly intense reflections | 0.0401 |
Weighted residual factors for significantly intense reflections | 0.0827 |
Weighted residual factors for all reflections included in the refinement | 0.0907 |
Goodness-of-fit parameter for all reflections included in the refinement | 1.051 |
Diffraction radiation wavelength | 0.71073 Å |
Diffraction radiation type | MoKα |