Information card for entry 7058831
Formula | C27 H15 Cd2 N6 O13 |
Calculated formula | C27 H15 Cd2 N6 O13 |
Title of publication | Two mixed-ligand Cd(ii)‒organic frameworks with unique topologies: selective luminescence sensing of TNP and Cu2+ ions with recyclable performances |
Authors of publication | Zhang, Jinfang; Jia, Wen; Wu, Junjie; Tang, Guodong; Zhang, Chi |
Journal of publication | New Journal of Chemistry |
Year of publication | 2019 |
Journal volume | 43 |
Journal issue | 40 |
Pages of publication | 16078 |
a | 29.0421 ± 0.0008 Å |
b | 6.7638 ± 0.0002 Å |
c | 29.6483 ± 0.0008 Å |
α | 90° |
β | 114.767 ± 0.001° |
γ | 90° |
Cell volume | 5288.3 ± 0.3 Å3 |
Cell temperature | 150 ± 2 K |
Ambient diffraction temperature | 150 ± 2 K |
Number of distinct elements | 5 |
Space group number | 15 |
Hermann-Mauguin space group symbol | C 1 2/c 1 |
Hall space group symbol | -C 2yc |
Residual factor for all reflections | 0.0386 |
Residual factor for significantly intense reflections | 0.0289 |
Weighted residual factors for significantly intense reflections | 0.0735 |
Weighted residual factors for all reflections included in the refinement | 0.0777 |
Goodness-of-fit parameter for all reflections included in the refinement | 1.067 |
Diffraction radiation wavelength | 0.71073 Å |
Diffraction radiation type | MoKα |