Information card for entry 7058833
Formula | C19 H19 N O4 Zn |
Calculated formula | C19 H19 N O4 Zn |
Title of publication | Two zinc(ii)-based coordination polymers with flexible dicarboxylate and pyridine mixed ligands: effect of π⋯π interactions on electrical activity |
Authors of publication | Akhtaruzzaman, Akhtaruzzaman; Das, Pubali; Khan, Samim; Maity, Suvendu; Naaz, Sanobar; Islam, Sakhiul; Ghosh, Prasanta; Ray, Partha Pratim; Mir, Mohammad Hedayetullah |
Journal of publication | New Journal of Chemistry |
Year of publication | 2019 |
Journal volume | 43 |
Journal issue | 40 |
Pages of publication | 16071 |
a | 8.5614 ± 0.0003 Å |
b | 9.3895 ± 0.0003 Å |
c | 11.0353 ± 0.0003 Å |
α | 83.849 ± 0.001° |
β | 84.682 ± 0.001° |
γ | 81.134 ± 0.001° |
Cell volume | 868.83 ± 0.05 Å3 |
Cell temperature | 294 ± 2 K |
Ambient diffraction temperature | 294 ± 2 K |
Number of distinct elements | 5 |
Space group number | 2 |
Hermann-Mauguin space group symbol | P -1 |
Hall space group symbol | -P 1 |
Residual factor for all reflections | 0.0487 |
Residual factor for significantly intense reflections | 0.0361 |
Weighted residual factors for significantly intense reflections | 0.1084 |
Weighted residual factors for all reflections included in the refinement | 0.1238 |
Goodness-of-fit parameter for all reflections included in the refinement | 0.942 |
Diffraction radiation wavelength | 0.71073 Å |
Diffraction radiation type | MoKα |