Information card for entry 7058834
Formula | C32 H44 Br2 Cu2 N10 O2 |
Calculated formula | C32 H44 Br2 Cu2 N10 O2 |
Title of publication | Azido bridged binuclear copper(ii) Schiff base compound: synthesis, structure and electrical properties |
Authors of publication | Ghosh, Mrinmoy; Saha, Sandip; Banerjee, Abhijit; Schollmeyer, Dieter; Sarkar, Ananda; Banerjee, Saikat |
Journal of publication | New Journal of Chemistry |
Year of publication | 2019 |
Journal volume | 43 |
Journal issue | 41 |
Pages of publication | 16255 |
a | 8.8242 ± 0.0007 Å |
b | 10.456 ± 0.0008 Å |
c | 11.0688 ± 0.0008 Å |
α | 66.252 ± 0.006° |
β | 70.368 ± 0.006° |
γ | 84.614 ± 0.006° |
Cell volume | 879.44 ± 0.13 Å3 |
Cell temperature | 193 ± 2 K |
Ambient diffraction temperature | 193 ± 2 K |
Number of distinct elements | 6 |
Space group number | 2 |
Hermann-Mauguin space group symbol | P -1 |
Hall space group symbol | -P 1 |
Residual factor for all reflections | 0.124 |
Residual factor for significantly intense reflections | 0.0727 |
Weighted residual factors for significantly intense reflections | 0.192 |
Weighted residual factors for all reflections included in the refinement | 0.2271 |
Goodness-of-fit parameter for all reflections included in the refinement | 0.982 |
Diffraction radiation wavelength | 0.71073 Å |
Diffraction radiation type | MoKα |