Information card for entry 7058842
Formula | C35 H39 N3 |
Calculated formula | C35 H39 N3 |
Title of publication | Multifunctional fluorescent leucomalachite green derivatives for chemodosimetric detection of Fe3+, specific imaging of lipid droplets and intracellular pH monitoring |
Authors of publication | Divya, Thekke Thattariyil; Raghav, Darpan; Rathinasamy, Krishnan; Chakkumkumarath, Lakshmi |
Journal of publication | New Journal of Chemistry |
Year of publication | 2019 |
Journal volume | 43 |
Journal issue | 41 |
Pages of publication | 16349 |
a | 13.777 ± 0.003 Å |
b | 10.069 ± 0.002 Å |
c | 20.859 ± 0.004 Å |
α | 90° |
β | 91.861 ± 0.012° |
γ | 90° |
Cell volume | 2892 ± 1 Å3 |
Cell temperature | 296 ± 2 K |
Ambient diffraction temperature | 296 ± 2 K |
Number of distinct elements | 3 |
Space group number | 14 |
Hermann-Mauguin space group symbol | P 1 21/c 1 |
Hall space group symbol | -P 2ybc |
Residual factor for all reflections | 0.2423 |
Residual factor for significantly intense reflections | 0.0785 |
Weighted residual factors for significantly intense reflections | 0.2029 |
Weighted residual factors for all reflections included in the refinement | 0.3058 |
Goodness-of-fit parameter for all reflections included in the refinement | 0.915 |
Diffraction radiation wavelength | 0.71073 Å |
Diffraction radiation type | MoKα |