Information card for entry 7058843
Formula | C21 H22 N2 O3 |
Calculated formula | C21 H22 N2 O3 |
Title of publication | Simple fabrication of a carbaldehyde based fluorescent “turn-on” probe for the selective and sole detection of Pd2+: application as test strips |
Authors of publication | Manna, Chandan Kumar; Gharami, Saswati; Aich, Krishnendu; Patra, Lakshman; Mondal, Tapan K. |
Journal of publication | New Journal of Chemistry |
Year of publication | 2019 |
Journal volume | 43 |
Journal issue | 43 |
Pages of publication | 16915 |
a | 6.8046 ± 0.0005 Å |
b | 9.5931 ± 0.0008 Å |
c | 14.6934 ± 0.0012 Å |
α | 95.313 ± 0.003° |
β | 102.442 ± 0.002° |
γ | 105.848 ± 0.003° |
Cell volume | 889.23 ± 0.12 Å3 |
Cell temperature | 293 ± 2 K |
Ambient diffraction temperature | 293 ± 2 K |
Number of distinct elements | 4 |
Space group number | 2 |
Hermann-Mauguin space group symbol | P -1 |
Hall space group symbol | -P 1 |
Residual factor for all reflections | 0.072 |
Residual factor for significantly intense reflections | 0.0495 |
Weighted residual factors for significantly intense reflections | 0.1363 |
Weighted residual factors for all reflections included in the refinement | 0.1586 |
Goodness-of-fit parameter for all reflections included in the refinement | 1.042 |
Diffraction radiation wavelength | 0.71073 Å |
Diffraction radiation type | MoKα |