Information card for entry 7058845
Formula | C28 H29 Cl3 Cu F N6 O4 |
Calculated formula | C28 H29 Cl2.9999 Cu F N6 O4 |
Title of publication | Copper(ii) complexes based on levofloxacin and 2N-donor ligands: synthesis, crystal structures and in vitro biological evaluation |
Authors of publication | Kumar, Manish; Kumar, Gyanendra; Dadure, Kanhaiya M.; Masram, Dhanraj T. |
Journal of publication | New Journal of Chemistry |
Year of publication | 2019 |
Journal volume | 43 |
Journal issue | 38 |
Pages of publication | 15462 |
a | 15.1992 ± 0.0016 Å |
b | 13.4765 ± 0.0011 Å |
c | 15.5358 ± 0.0017 Å |
α | 90° |
β | 103.078 ± 0.011° |
γ | 90° |
Cell volume | 3099.7 ± 0.6 Å3 |
Cell temperature | 298 ± 2 K |
Ambient diffraction temperature | 298.15 K |
Number of distinct elements | 7 |
Space group number | 14 |
Hermann-Mauguin space group symbol | P 1 21/n 1 |
Hall space group symbol | -P 2yn |
Residual factor for all reflections | 0.1074 |
Residual factor for significantly intense reflections | 0.0697 |
Weighted residual factors for significantly intense reflections | 0.1598 |
Weighted residual factors for all reflections included in the refinement | 0.179 |
Goodness-of-fit parameter for all reflections included in the refinement | 1.077 |
Diffraction radiation probe | x-ray |
Diffraction radiation wavelength | 0.71073 Å |
Diffraction radiation type | MoKα |