Information card for entry 7058844
Formula | C36 H36 Co N12 O4 S |
Calculated formula | C36 H36 Co N12 O3.999 S |
Title of publication | A novel nitrogen heterocyclic ligand-based MOF: synthesis, characterization and photocatalytic properties |
Authors of publication | Shang, Qigao; Zeng, Tianyu; Gao, Ke; Liu, Nannan; Cheng, Qingrong; Liao, Guiying; Pan, Zhiquan; Zhou, Hong |
Journal of publication | New Journal of Chemistry |
Year of publication | 2019 |
Journal volume | 43 |
Journal issue | 42 |
Pages of publication | 16595 |
a | 19.6072 ± 0.0006 Å |
b | 19.6072 ± 0.0006 Å |
c | 24.0094 ± 0.0013 Å |
α | 90° |
β | 90° |
γ | 120° |
Cell volume | 7993.6 ± 0.6 Å3 |
Cell temperature | 173 ± 2 K |
Ambient diffraction temperature | 173 ± 2 K |
Number of distinct elements | 6 |
Space group number | 173 |
Hermann-Mauguin space group symbol | P 63 |
Hall space group symbol | P 6c |
Residual factor for all reflections | 0.1302 |
Residual factor for significantly intense reflections | 0.0685 |
Weighted residual factors for significantly intense reflections | 0.1583 |
Weighted residual factors for all reflections included in the refinement | 0.1943 |
Goodness-of-fit parameter for all reflections included in the refinement | 1.089 |
Diffraction radiation wavelength | 0.71073 Å |
Diffraction radiation type | MoKα |