Information card for entry 7058848
Formula | C28 H23 N5 O3 V |
Calculated formula | C28 H23 N5 O3 V |
Title of publication | Synthesis, characterization, and cytotoxic and antimicrobial activities of mixed-ligand hydrazone complexes of variable valence VOz+ (z = 2, 3) |
Authors of publication | Biswas, Nirmalendu; Bera, Sachinath; Sepay, Nayim; Mukhopadhyay, Titas Kumar; Acharya, Krishnendu; Ghosh, Sandipta; Acharyya, Swarnali; Biswas, Anup Kumar; Drew, Michael G. B.; Ghosh, Tapas |
Journal of publication | New Journal of Chemistry |
Year of publication | 2019 |
Journal volume | 43 |
Journal issue | 42 |
Pages of publication | 16714 |
a | 10.2716 ± 0.001 Å |
b | 10.6456 ± 0.0009 Å |
c | 12.1344 ± 0.0009 Å |
α | 81.817 ± 0.007° |
β | 70.266 ± 0.008° |
γ | 82.082 ± 0.007° |
Cell volume | 1230.48 ± 0.19 Å3 |
Cell temperature | 100 ± 0.02 K |
Ambient diffraction temperature | 100 ± 0.02 K |
Number of distinct elements | 5 |
Space group number | 1 |
Hermann-Mauguin space group symbol | P 1 |
Hall space group symbol | P 1 |
Residual factor for all reflections | 0.0856 |
Residual factor for significantly intense reflections | 0.0621 |
Weighted residual factors for significantly intense reflections | 0.1198 |
Weighted residual factors for all reflections included in the refinement | 0.1349 |
Goodness-of-fit parameter for all reflections included in the refinement | 1.006 |
Diffraction radiation wavelength | 0.71073 Å |
Diffraction radiation type | MoKα |