Information card for entry 7058849
Formula | C24 H19 N4 O4 V |
Calculated formula | C24 H19 N4 O4 V |
Title of publication | Synthesis, characterization, and cytotoxic and antimicrobial activities of mixed-ligand hydrazone complexes of variable valence VOz+ (z = 2, 3) |
Authors of publication | Biswas, Nirmalendu; Bera, Sachinath; Sepay, Nayim; Mukhopadhyay, Titas Kumar; Acharya, Krishnendu; Ghosh, Sandipta; Acharyya, Swarnali; Biswas, Anup Kumar; Drew, Michael G. B.; Ghosh, Tapas |
Journal of publication | New Journal of Chemistry |
Year of publication | 2019 |
Journal volume | 43 |
Journal issue | 42 |
Pages of publication | 16714 |
a | 7.8475 ± 0.0005 Å |
b | 10.8678 ± 0.0009 Å |
c | 14.0113 ± 0.0012 Å |
α | 68.768 ± 0.008° |
β | 77.151 ± 0.007° |
γ | 72.756 ± 0.007° |
Cell volume | 1054.86 ± 0.16 Å3 |
Cell temperature | 150 ± 2 K |
Ambient diffraction temperature | 150 ± 2 K |
Number of distinct elements | 5 |
Space group number | 2 |
Hermann-Mauguin space group symbol | P -1 |
Hall space group symbol | -P 1 |
Residual factor for all reflections | 0.0559 |
Residual factor for significantly intense reflections | 0.0441 |
Weighted residual factors for significantly intense reflections | 0.0984 |
Weighted residual factors for all reflections included in the refinement | 0.1041 |
Goodness-of-fit parameter for all reflections included in the refinement | 1.012 |
Diffraction radiation wavelength | 0.71073 Å |
Diffraction radiation type | MoKα |