Information card for entry 7058850
Formula | C24 H18 Cl N4 O4 V |
Calculated formula | C24 H18 Cl N4 O4 V |
Title of publication | Synthesis, characterization, and cytotoxic and antimicrobial activities of mixed-ligand hydrazone complexes of variable valence VOz+ (z = 2, 3) |
Authors of publication | Biswas, Nirmalendu; Bera, Sachinath; Sepay, Nayim; Mukhopadhyay, Titas Kumar; Acharya, Krishnendu; Ghosh, Sandipta; Acharyya, Swarnali; Biswas, Anup Kumar; Drew, Michael G. B.; Ghosh, Tapas |
Journal of publication | New Journal of Chemistry |
Year of publication | 2019 |
Journal volume | 43 |
Journal issue | 42 |
Pages of publication | 16714 |
a | 12.6574 ± 0.0004 Å |
b | 7.6841 ± 0.0002 Å |
c | 22.0915 ± 0.0007 Å |
α | 90° |
β | 91.06 ± 0.003° |
γ | 90° |
Cell volume | 2148.27 ± 0.11 Å3 |
Cell temperature | 100 ± 2 K |
Ambient diffraction temperature | 100 ± 2 K |
Number of distinct elements | 6 |
Space group number | 14 |
Hermann-Mauguin space group symbol | P 1 21/n 1 |
Hall space group symbol | -P 2yn |
Residual factor for all reflections | 0.0411 |
Residual factor for significantly intense reflections | 0.0354 |
Weighted residual factors for significantly intense reflections | 0.092 |
Weighted residual factors for all reflections included in the refinement | 0.0967 |
Goodness-of-fit parameter for all reflections included in the refinement | 1.051 |
Diffraction radiation wavelength | 0.71073 Å |
Diffraction radiation type | MoKα |