Information card for entry 7058866
Formula | C78 H66 Bi2 N12 O18 S12 |
Calculated formula | C78 H66 Bi2 N12 O18 S12 |
Title of publication | Impact of substituents on the crystal structures and anti-leishmanial activity of new homoleptic Bi(iii) dithiocarbamates |
Authors of publication | Anamika, Anamika; Singh, Rajan; Manar, Krishna K.; Yadav, Chote Lal; Kumar, Akhilesh; Singh, Rakesh K.; Drew, Michael. G. B.; Singh, Nanhai |
Journal of publication | New Journal of Chemistry |
Year of publication | 2019 |
Journal volume | 43 |
Journal issue | 43 |
Pages of publication | 16921 |
a | 11.2572 ± 0.0008 Å |
b | 12.2386 ± 0.0011 Å |
c | 32.278 ± 0.002 Å |
α | 90° |
β | 97.857 ± 0.007° |
γ | 90° |
Cell volume | 4405.3 ± 0.6 Å3 |
Cell temperature | 150 ± 2 K |
Ambient diffraction temperature | 150 ± 2 K |
Number of distinct elements | 6 |
Space group number | 14 |
Hermann-Mauguin space group symbol | P 1 21/n 1 |
Hall space group symbol | -P 2yn |
Residual factor for all reflections | 0.1706 |
Residual factor for significantly intense reflections | 0.0975 |
Weighted residual factors for significantly intense reflections | 0.1422 |
Weighted residual factors for all reflections included in the refinement | 0.1664 |
Goodness-of-fit parameter for all reflections included in the refinement | 1.074 |
Diffraction radiation wavelength | 0.71073 Å |
Diffraction radiation type | MoKα |