Information card for entry 7058867
Formula | C96 H94 Bi2 N6 O6 S12 |
Calculated formula | C96 H94 Bi2 N6 O6 S12 |
Title of publication | Impact of substituents on the crystal structures and anti-leishmanial activity of new homoleptic Bi(iii) dithiocarbamates |
Authors of publication | Anamika, Anamika; Singh, Rajan; Manar, Krishna K.; Yadav, Chote Lal; Kumar, Akhilesh; Singh, Rakesh K.; Drew, Michael. G. B.; Singh, Nanhai |
Journal of publication | New Journal of Chemistry |
Year of publication | 2019 |
Journal volume | 43 |
Journal issue | 43 |
Pages of publication | 16921 |
a | 13.8565 ± 0.001 Å |
b | 14.7079 ± 0.0011 Å |
c | 24.3613 ± 0.0019 Å |
α | 90° |
β | 103.156 ± 0.002° |
γ | 90° |
Cell volume | 4834.5 ± 0.6 Å3 |
Cell temperature | 298 ± 2 K |
Ambient diffraction temperature | 298 ± 2 K |
Number of distinct elements | 6 |
Space group number | 14 |
Hermann-Mauguin space group symbol | P 1 21/n 1 |
Hall space group symbol | -P 2yn |
Residual factor for all reflections | 0.0687 |
Residual factor for significantly intense reflections | 0.0551 |
Weighted residual factors for significantly intense reflections | 0.1372 |
Weighted residual factors for all reflections included in the refinement | 0.1421 |
Goodness-of-fit parameter for all reflections included in the refinement | 1.221 |
Diffraction radiation wavelength | 0.71073 Å |
Diffraction radiation type | MoKα |