Information card for entry 7058868
Formula | C84 H73 Bi2 Br6 Cl N12 S12 |
Calculated formula | C84 H73 Bi2 Br6 Cl N12 S12 |
Title of publication | Impact of substituents on the crystal structures and anti-leishmanial activity of new homoleptic Bi(iii) dithiocarbamates |
Authors of publication | Anamika, Anamika; Singh, Rajan; Manar, Krishna K.; Yadav, Chote Lal; Kumar, Akhilesh; Singh, Rakesh K.; Drew, Michael. G. B.; Singh, Nanhai |
Journal of publication | New Journal of Chemistry |
Year of publication | 2019 |
Journal volume | 43 |
Journal issue | 43 |
Pages of publication | 16921 |
a | 11.1582 ± 0.0008 Å |
b | 12.5194 ± 0.001 Å |
c | 16.8066 ± 0.0014 Å |
α | 99.065 ± 0.007° |
β | 101.081 ± 0.007° |
γ | 92.411 ± 0.006° |
Cell volume | 2268.9 ± 0.3 Å3 |
Cell temperature | 150 ± 2 K |
Ambient diffraction temperature | 150 ± 2 K |
Number of distinct elements | 7 |
Space group number | 2 |
Hermann-Mauguin space group symbol | P -1 |
Hall space group symbol | -P 1 |
Residual factor for all reflections | 0.1296 |
Residual factor for significantly intense reflections | 0.0895 |
Weighted residual factors for significantly intense reflections | 0.1992 |
Weighted residual factors for all reflections included in the refinement | 0.2222 |
Goodness-of-fit parameter for all reflections included in the refinement | 1.061 |
Diffraction radiation wavelength | 0.71073 Å |
Diffraction radiation type | MoKα |