Information card for entry 7059277
Formula | C24 H8 F8 I4 N |
Calculated formula | C24 H8 F8 I4 N |
Title of publication | Synthesis and spectral characterizations of water soluble Cu(ii) complexes containing N-heterocyclic chelates: cell-proliferation, antioxidant and nucleic acid/serum albumin interactions |
Authors of publication | Elamathi, C.; Fronczek, Frank R.; Madankumar, A.; Prabhakaran, R. |
Journal of publication | New Journal of Chemistry |
Year of publication | 2020 |
Journal volume | 44 |
Journal issue | 10 |
Pages of publication | 4158 - 4170 |
a | 5.9625 ± 0.0011 Å |
b | 9.3712 ± 0.0018 Å |
c | 12.051 ± 0.002 Å |
α | 75.207 ± 0.003° |
β | 88.706 ± 0.003° |
γ | 80.057 ± 0.003° |
Cell volume | 641.1 ± 0.2 Å3 |
Cell temperature | 150 ± 2 K |
Ambient diffraction temperature | 150 ± 2 K |
Number of distinct elements | 5 |
Space group number | 2 |
Hermann-Mauguin space group symbol | P -1 |
Hall space group symbol | -P 1 |
Residual factor for all reflections | 0.041 |
Residual factor for significantly intense reflections | 0.0325 |
Weighted residual factors for significantly intense reflections | 0.0746 |
Weighted residual factors for all reflections included in the refinement | 0.0789 |
Goodness-of-fit parameter for all reflections included in the refinement | 1.018 |
Diffraction radiation wavelength | 0.71073 Å |
Diffraction radiation type | MoKα |