Information card for entry 7059278
Formula | C28.5 H31 Cu F12 N4 O6 |
Calculated formula | C28.5 H31 Cu F12 N4 O6 |
Title of publication | Synthesis and spectral characterizations of water soluble Cu(ii) complexes containing N-heterocyclic chelates: cell-proliferation, antioxidant and nucleic acid/serum albumin interactions |
Authors of publication | Elamathi, C.; Fronczek, Frank R.; Madankumar, A.; Prabhakaran, R. |
Journal of publication | New Journal of Chemistry |
Year of publication | 2020 |
Journal volume | 44 |
Journal issue | 10 |
Pages of publication | 4158 - 4170 |
a | 10.7592 ± 0.0009 Å |
b | 13.2163 ± 0.001 Å |
c | 13.8207 ± 0.0012 Å |
α | 99.285 ± 0.006° |
β | 106.566 ± 0.006° |
γ | 100.756 ± 0.006° |
Cell volume | 1801.9 ± 0.3 Å3 |
Cell temperature | 298 ± 2 K |
Ambient diffraction temperature | 298 ± 2 K |
Number of distinct elements | 6 |
Space group number | 2 |
Hermann-Mauguin space group symbol | P -1 |
Hall space group symbol | -P 1 |
Residual factor for all reflections | 0.1279 |
Residual factor for significantly intense reflections | 0.0412 |
Weighted residual factors for significantly intense reflections | 0.0875 |
Weighted residual factors for all reflections included in the refinement | 0.1061 |
Goodness-of-fit parameter for all reflections included in the refinement | 0.726 |
Diffraction radiation wavelength | 0.71073 Å |
Diffraction radiation type | MoKα |