Information card for entry 7060482
Formula | C18 H18 Cl2 N2 Pt S4 |
Calculated formula | C18 H18 Cl2 N2 Pt S4 |
Title of publication | Synthesis and structure of thienyl Fischer carbene complexes of PtII for application in alkyne hydrosilylation |
Authors of publication | Lamprecht, Zandria; Malan, Frederick P.; Lotz, Simon; Bezuidenhout, Daniela I. |
Journal of publication | New Journal of Chemistry |
Year of publication | 2021 |
Journal volume | 45 |
Journal issue | 14 |
Pages of publication | 6220 - 6230 |
a | 11.1318 ± 0.0006 Å |
b | 17.0266 ± 0.0007 Å |
c | 12.4532 ± 0.0007 Å |
α | 90° |
β | 110.318 ± 0.007° |
γ | 90° |
Cell volume | 2213.5 ± 0.2 Å3 |
Cell temperature | 293 ± 2 K |
Ambient diffraction temperature | 293 ± 2 K |
Number of distinct elements | 6 |
Space group number | 14 |
Hermann-Mauguin space group symbol | P 1 21/c 1 |
Hall space group symbol | -P 2ybc |
Residual factor for all reflections | 0.0867 |
Residual factor for significantly intense reflections | 0.0554 |
Weighted residual factors for significantly intense reflections | 0.12 |
Weighted residual factors for all reflections included in the refinement | 0.1327 |
Goodness-of-fit parameter for all reflections included in the refinement | 0.958 |
Diffraction radiation wavelength | 0.71073 Å |
Diffraction radiation type | MoKα |