Information card for entry 7060483
Formula | C14 H16 Cl2 N0 O2 Pt S2 |
Calculated formula | C14 H16 Cl2 O2 Pt S2 |
Title of publication | Synthesis and structure of thienyl Fischer carbene complexes of PtII for application in alkyne hydrosilylation |
Authors of publication | Lamprecht, Zandria; Malan, Frederick P.; Lotz, Simon; Bezuidenhout, Daniela I. |
Journal of publication | New Journal of Chemistry |
Year of publication | 2021 |
Journal volume | 45 |
Journal issue | 14 |
Pages of publication | 6220 - 6230 |
a | 11.5072 ± 0.0005 Å |
b | 9.7623 ± 0.0003 Å |
c | 16.4968 ± 0.0006 Å |
α | 90° |
β | 109.328 ± 0.004° |
γ | 90° |
Cell volume | 1748.75 ± 0.12 Å3 |
Cell temperature | 150 ± 2 K |
Ambient diffraction temperature | 150 ± 2 K |
Number of distinct elements | 7 |
Space group number | 14 |
Hermann-Mauguin space group symbol | P 1 21/n 1 |
Hall space group symbol | -P 2yn |
Residual factor for all reflections | 0.0506 |
Residual factor for significantly intense reflections | 0.0453 |
Weighted residual factors for significantly intense reflections | 0.108 |
Weighted residual factors for all reflections included in the refinement | 0.1105 |
Goodness-of-fit parameter for all reflections included in the refinement | 1.125 |
Diffraction radiation wavelength | 0.71073 Å |
Diffraction radiation type | MoKα |