Information card for entry 7060578
Formula | C30 H27 Bi2 Cl4 N9 S2 |
Calculated formula | C30 H27 Bi2 Cl4 N9 S2 |
Title of publication | Heteroleptic enantiopure Pd(ii)-complexes derived from halogen-substituted Schiff bases and 2-picolylamine: synthesis, experimental and computational characterization and investigation of the influence of chirality and halogen atoms on the anticancer activity |
Authors of publication | Kordestani, Nazanin; Amiri Rudbari, Hadi; Correia, Isabel; Valente, Andreia; Côrte-Real, Leonor; Islam, Mohammad Khairul; Micale, Nicola; Braun, Jason D.; Herbert, David E.; Tumanov, Nikolay; Wouters, Johan; Enamullah, Mohammed |
Journal of publication | New Journal of Chemistry |
Year of publication | 2021 |
Journal volume | 45 |
Journal issue | 20 |
Pages of publication | 9163 - 9180 |
a | 17.3774 ± 0.0004 Å |
b | 28.6511 ± 0.0007 Å |
c | 7.6327 ± 0.0002 Å |
α | 90° |
β | 90° |
γ | 90° |
Cell volume | 3800.18 ± 0.16 Å3 |
Cell temperature | 298.15 K |
Ambient diffraction temperature | 298.15 K |
Number of distinct elements | 6 |
Space group number | 62 |
Hermann-Mauguin space group symbol | P n m a |
Hall space group symbol | -P 2ac 2n |
Residual factor for all reflections | 0.0509 |
Residual factor for significantly intense reflections | 0.0354 |
Weighted residual factors for significantly intense reflections | 0.0641 |
Weighted residual factors for all reflections included in the refinement | 0.0684 |
Goodness-of-fit parameter for all reflections included in the refinement | 1.046 |
Diffraction radiation probe | x-ray |
Diffraction radiation wavelength | 0.71073 Å |
Diffraction radiation type | MoKα |