Information card for entry 7060579
Formula | C10 H14 Cl N O2 |
Calculated formula | C10 H14 Cl N O2 |
Title of publication | Heteroleptic enantiopure Pd(ii)-complexes derived from halogen-substituted Schiff bases and 2-picolylamine: synthesis, experimental and computational characterization and investigation of the influence of chirality and halogen atoms on the anticancer activity |
Authors of publication | Kordestani, Nazanin; Amiri Rudbari, Hadi; Correia, Isabel; Valente, Andreia; Côrte-Real, Leonor; Islam, Mohammad Khairul; Micale, Nicola; Braun, Jason D.; Herbert, David E.; Tumanov, Nikolay; Wouters, Johan; Enamullah, Mohammed |
Journal of publication | New Journal of Chemistry |
Year of publication | 2021 |
Journal volume | 45 |
Journal issue | 20 |
Pages of publication | 9163 - 9180 |
a | 15.8971 ± 0.0007 Å |
b | 6.3996 ± 0.0002 Å |
c | 21.4345 ± 0.001 Å |
α | 90° |
β | 90.022 ± 0.004° |
γ | 90° |
Cell volume | 2180.64 ± 0.16 Å3 |
Cell temperature | 123 ± 2 K |
Ambient diffraction temperature | 123 ± 2 K |
Number of distinct elements | 5 |
Space group number | 15 |
Hermann-Mauguin space group symbol | C 1 2/c 1 |
Hall space group symbol | -C 2yc |
Residual factor for all reflections | 0.0525 |
Residual factor for significantly intense reflections | 0.049 |
Weighted residual factors for significantly intense reflections | 0.1341 |
Weighted residual factors for all reflections included in the refinement | 0.1399 |
Goodness-of-fit parameter for all reflections included in the refinement | 1.026 |
Diffraction radiation wavelength | 1.54184 Å |
Diffraction radiation type | CuKα |