Information card for entry 7063351
Formula | C33 H33 F11 N3 O Si V |
Calculated formula | C33 H33 F11 N3 O Si V |
Title of publication | Vanadium(v) arylimido alkylidene N-heterocyclic carbene complexes containing fluorinated alkoxide or halogenated phenoxide ligands for the syndiospecific ROMP of cyclic olefins |
Authors of publication | Nomura, Kotohiro; Kuwahara, Shuko; Suthala, Jirapa; Kawamoto, Yuta; Shimoyama, Daisuke; Buchmeiser, Michael R. |
Journal of publication | New Journal of Chemistry |
Year of publication | 2024 |
Journal volume | 48 |
Journal issue | 34 |
Pages of publication | 14865 - 14872 |
a | 9.6615 ± 0.0004 Å |
b | 12.4091 ± 0.0004 Å |
c | 16.1836 ± 0.0005 Å |
α | 91.24 ± 0.002° |
β | 95.293 ± 0.003° |
γ | 111.9 ± 0.003° |
Cell volume | 1789.27 ± 0.12 Å3 |
Cell temperature | 93 ± 2 K |
Ambient diffraction temperature | 93 ± 2 K |
Number of distinct elements | 7 |
Space group number | 2 |
Hermann-Mauguin space group symbol | P -1 |
Hall space group symbol | -P 1 |
Residual factor for all reflections | 0.0863 |
Residual factor for significantly intense reflections | 0.079 |
Weighted residual factors for significantly intense reflections | 0.218 |
Weighted residual factors for all reflections included in the refinement | 0.2238 |
Goodness-of-fit parameter for all reflections included in the refinement | 1.041 |
Diffraction radiation probe | x-ray |
Diffraction radiation wavelength | 0.71073 Å |
Diffraction radiation type | MoKα |