Information card for entry 7063369
Formula | C68.84 H80.53 Cl1.16 Lu2 N6 S2 Si4 |
Calculated formula | C68.84 H80.52 Cl1.16 Lu2 N6 S2 Si4 |
Title of publication | Difunctionalized indol-2-yl-ligated bimetallic rare-earth metal complexes: synthesis, characterization and high activity towards polymerization of 2-vinylpyridine |
Authors of publication | Zhao, Zhiwei; Tong, Yao; Liu, ChenCheng; Huang, Zeming; Wang, Shaowu; Wang, Fenhua |
Journal of publication | New Journal of Chemistry |
Year of publication | 2024 |
Journal volume | 48 |
Journal issue | 33 |
Pages of publication | 14690 - 14696 |
a | 14.6276 ± 0.0018 Å |
b | 19.47 ± 0.002 Å |
c | 25.369 ± 0.002 Å |
α | 90° |
β | 100.885 ± 0.004° |
γ | 90° |
Cell volume | 7095.1 ± 1.3 Å3 |
Cell temperature | 296.15 ± 0.1 K |
Ambient diffraction temperature | 296.15 ± 0.1 K |
Number of distinct elements | 7 |
Space group number | 15 |
Hermann-Mauguin space group symbol | C 1 2/c 1 |
Hall space group symbol | -C 2yc |
Residual factor for all reflections | 0.1085 |
Residual factor for significantly intense reflections | 0.0574 |
Weighted residual factors for significantly intense reflections | 0.1244 |
Weighted residual factors for all reflections included in the refinement | 0.1437 |
Goodness-of-fit parameter for all reflections included in the refinement | 1.03 |
Diffraction radiation probe | x-ray |
Diffraction radiation wavelength | 0.71073 Å |
Diffraction radiation type | MoKα |