Information card for entry 7063370
Formula | C55 H52 N6 S2 Si2 Yb |
Calculated formula | C55 H52 N6 S2 Si2 Yb |
Title of publication | Difunctionalized indol-2-yl-ligated bimetallic rare-earth metal complexes: synthesis, characterization and high activity towards polymerization of 2-vinylpyridine |
Authors of publication | Zhao, Zhiwei; Tong, Yao; Liu, ChenCheng; Huang, Zeming; Wang, Shaowu; Wang, Fenhua |
Journal of publication | New Journal of Chemistry |
Year of publication | 2024 |
Journal volume | 48 |
Journal issue | 33 |
Pages of publication | 14690 - 14696 |
a | 15.0398 ± 0.0011 Å |
b | 17.4864 ± 0.0011 Å |
c | 20.0662 ± 0.0013 Å |
α | 90° |
β | 101.427 ± 0.003° |
γ | 90° |
Cell volume | 5172.6 ± 0.6 Å3 |
Cell temperature | 296.15 ± 0.1 K |
Ambient diffraction temperature | 296.15 ± 0.1 K |
Number of distinct elements | 6 |
Space group number | 15 |
Hermann-Mauguin space group symbol | C 1 2/c 1 |
Hall space group symbol | -C 2yc |
Residual factor for all reflections | 0.0358 |
Residual factor for significantly intense reflections | 0.0282 |
Weighted residual factors for significantly intense reflections | 0.0668 |
Weighted residual factors for all reflections included in the refinement | 0.0693 |
Goodness-of-fit parameter for all reflections included in the refinement | 1.049 |
Diffraction radiation probe | x-ray |
Diffraction radiation wavelength | 0.71073 Å |
Diffraction radiation type | MoKα |