Information card for entry 7063382
Chemical name | Nickel complex |
Formula | C27 H30 N4 Ni |
Calculated formula | C27 H30 N4 Ni |
Title of publication | Steric influence and controlled dynamic process in a chiral square planar nickel(ii) complex supported by a dipyrromethane-based NNNN tetradentate ligand |
Authors of publication | Guchhait, Tapas; Giri, Monalisa; Mishra, Soumya; Roy, Satabdi |
Journal of publication | New Journal of Chemistry |
Year of publication | 2024 |
Journal volume | 48 |
Journal issue | 34 |
Pages of publication | 15240 - 15247 |
a | 9.4714 ± 0.0005 Å |
b | 15.7034 ± 0.0008 Å |
c | 15.8686 ± 0.0009 Å |
α | 90° |
β | 90.069 ± 0.003° |
γ | 90° |
Cell volume | 2360.2 ± 0.2 Å3 |
Cell temperature | 296 K |
Ambient diffraction temperature | 296 K |
Number of distinct elements | 4 |
Space group number | 14 |
Hermann-Mauguin space group symbol | P 1 21/n 1 |
Hall space group symbol | -P 2yn |
Residual factor for all reflections | 0.0521 |
Residual factor for significantly intense reflections | 0.0348 |
Weighted residual factors for significantly intense reflections | 0.0905 |
Weighted residual factors for all reflections included in the refinement | 0.0998 |
Goodness-of-fit parameter for all reflections included in the refinement | 1.038 |
Diffraction radiation wavelength | 0.71073 Å |
Diffraction radiation type | MoKα |