Information card for entry 7063383
Formula | C25 H32 N6 Ni |
Calculated formula | C25 H32 N6 Ni |
Title of publication | Steric influence and controlled dynamic process in a chiral square planar nickel(ii) complex supported by a dipyrromethane-based NNNN tetradentate ligand |
Authors of publication | Guchhait, Tapas; Giri, Monalisa; Mishra, Soumya; Roy, Satabdi |
Journal of publication | New Journal of Chemistry |
Year of publication | 2024 |
Journal volume | 48 |
Journal issue | 34 |
Pages of publication | 15240 - 15247 |
a | 9.7367 ± 0.0006 Å |
b | 9.9869 ± 0.0006 Å |
c | 13.6433 ± 0.001 Å |
α | 108.007 ± 0.002° |
β | 93.048 ± 0.002° |
γ | 114.48 ± 0.002° |
Cell volume | 1122.8 ± 0.13 Å3 |
Cell temperature | 120 K |
Ambient diffraction temperature | 120 K |
Number of distinct elements | 4 |
Space group number | 2 |
Hermann-Mauguin space group symbol | P -1 |
Hall space group symbol | -P 1 |
Residual factor for all reflections | 0.0664 |
Residual factor for significantly intense reflections | 0.0539 |
Weighted residual factors for significantly intense reflections | 0.1529 |
Weighted residual factors for all reflections included in the refinement | 0.16 |
Goodness-of-fit parameter for all reflections included in the refinement | 1.131 |
Diffraction radiation wavelength | 0.71073 Å |
Diffraction radiation type | MoKα |