Information card for entry 7063385
Formula | C64 H86 N4 O8 Te2 |
Calculated formula | C64 H86 N4 O8 Te2 |
Title of publication | Adducts of a sterically hindered tellurium(iv) catecholate with diimines |
Authors of publication | Petrov, Pavel A.; Filippova, Elizaveta A.; Sukhikh, Taisiya S.; Sheven, Dmitriy G.; Novikov, Alexander S. |
Journal of publication | New Journal of Chemistry |
Year of publication | 2024 |
Journal volume | 48 |
Journal issue | 35 |
Pages of publication | 15483 - 15492 |
a | 10.2838 ± 0.0003 Å |
b | 11.0436 ± 0.0003 Å |
c | 14.4322 ± 0.0004 Å |
α | 71.019 ± 0.001° |
β | 85.098 ± 0.001° |
γ | 82.015 ± 0.001° |
Cell volume | 1533.5 ± 0.08 Å3 |
Cell temperature | 150.15 K |
Ambient diffraction temperature | 150.15 K |
Number of distinct elements | 5 |
Space group number | 2 |
Hermann-Mauguin space group symbol | P -1 |
Hall space group symbol | -P 1 |
Residual factor for all reflections | 0.0522 |
Residual factor for significantly intense reflections | 0.0417 |
Weighted residual factors for significantly intense reflections | 0.0962 |
Weighted residual factors for all reflections included in the refinement | 0.1062 |
Goodness-of-fit parameter for all reflections included in the refinement | 0.965 |
Diffraction radiation wavelength | 0.71073 Å |
Diffraction radiation type | MoKα |