Information card for entry 7063384
Formula | C10 H5 Eu O9 |
Calculated formula | C10 H5 Eu O9 |
Title of publication | A 3D photoluminescent Eu(iii)-MOF sensor supported by a tetracarboxylate ligand for the sensitive and selective detection of Cd2+ and o-nitrophenol |
Authors of publication | Sen, Charanjeet; Devi, Swaita; Niharika,; Bhagat, Nidhi; Sheikh, Haq Nawaz |
Journal of publication | New Journal of Chemistry |
Year of publication | 2024 |
Journal volume | 48 |
Journal issue | 34 |
Pages of publication | 15136 - 15148 |
a | 6.327 ± 0.0007 Å |
b | 9.2759 ± 0.001 Å |
c | 9.4488 ± 0.001 Å |
α | 88.275 ± 0.005° |
β | 73.972 ± 0.005° |
γ | 76.714 ± 0.005° |
Cell volume | 518.39 ± 0.1 Å3 |
Cell temperature | 200 ± 2 K |
Ambient diffraction temperature | 200 ± 2 K |
Number of distinct elements | 4 |
Space group number | 2 |
Hermann-Mauguin space group symbol | P -1 |
Hall space group symbol | -P 1 |
Residual factor for all reflections | 0.0336 |
Residual factor for significantly intense reflections | 0.0327 |
Weighted residual factors for significantly intense reflections | 0.0875 |
Weighted residual factors for all reflections included in the refinement | 0.0887 |
Goodness-of-fit parameter for all reflections included in the refinement | 1.129 |
Diffraction radiation wavelength | 1.54178 Å |
Diffraction radiation type | CuKα |