Information card for entry 7063389
Formula | C87 H104 N4 O8 Te2 |
Calculated formula | C87 H104 N4 O8 Te2 |
Title of publication | Adducts of a sterically hindered tellurium(iv) catecholate with diimines |
Authors of publication | Petrov, Pavel A.; Filippova, Elizaveta A.; Sukhikh, Taisiya S.; Sheven, Dmitriy G.; Novikov, Alexander S. |
Journal of publication | New Journal of Chemistry |
Year of publication | 2024 |
Journal volume | 48 |
Journal issue | 35 |
Pages of publication | 15483 - 15492 |
a | 10.5866 ± 0.0011 Å |
b | 13.8449 ± 0.0013 Å |
c | 15.3756 ± 0.0015 Å |
α | 107.42 ± 0.004° |
β | 108.898 ± 0.003° |
γ | 98.439 ± 0.004° |
Cell volume | 1958.8 ± 0.3 Å3 |
Cell temperature | 150.15 K |
Ambient diffraction temperature | 150.15 K |
Number of distinct elements | 5 |
Space group number | 2 |
Hermann-Mauguin space group symbol | P -1 |
Hall space group symbol | -P 1 |
Residual factor for all reflections | 0.038 |
Residual factor for significantly intense reflections | 0.0319 |
Weighted residual factors for significantly intense reflections | 0.0678 |
Weighted residual factors for all reflections included in the refinement | 0.0714 |
Goodness-of-fit parameter for all reflections included in the refinement | 1.045 |
Diffraction radiation wavelength | 0.71073 Å |
Diffraction radiation type | MoKα |