Information card for entry 7063390
Formula | C80.5 H97 Cl N4 O10 Te2 |
Calculated formula | C80 H96 N4 O10 Te2 |
Title of publication | Adducts of a sterically hindered tellurium(iv) catecholate with diimines |
Authors of publication | Petrov, Pavel A.; Filippova, Elizaveta A.; Sukhikh, Taisiya S.; Sheven, Dmitriy G.; Novikov, Alexander S. |
Journal of publication | New Journal of Chemistry |
Year of publication | 2024 |
Journal volume | 48 |
Journal issue | 35 |
Pages of publication | 15483 - 15492 |
a | 11.611 ± 0.0003 Å |
b | 18.372 ± 0.0007 Å |
c | 18.9824 ± 0.0008 Å |
α | 90° |
β | 106.946 ± 0.001° |
γ | 90° |
Cell volume | 3873.5 ± 0.2 Å3 |
Cell temperature | 150 ± 2 K |
Ambient diffraction temperature | 150 ± 2 K |
Number of distinct elements | 6 |
Space group number | 14 |
Hermann-Mauguin space group symbol | P 1 21/c 1 |
Hall space group symbol | -P 2ybc |
Residual factor for all reflections | 0.0564 |
Residual factor for significantly intense reflections | 0.0356 |
Weighted residual factors for significantly intense reflections | 0.0707 |
Weighted residual factors for all reflections included in the refinement | 0.0766 |
Goodness-of-fit parameter for all reflections included in the refinement | 1.025 |
Diffraction radiation wavelength | 0.71073 Å |
Diffraction radiation type | MoKα |