Information card for entry 7063391
Formula | C30 H20 Br2 N2 O |
Calculated formula | C30 H20 Br2 N2 O |
Title of publication | Synthesis of dimeric indoles from Friedel–Crafts reaction of indoles with ketones catalysed by a Brønsted acid ionic liquid and their interactions with BSA and DNA |
Authors of publication | Pasuparthy, Sai Deepak; Somkuwar, Pranati; Kali, Venkatesan; Somanahalli Kalleshappa, Ashok Kumar; Maiti, Barnali |
Journal of publication | New Journal of Chemistry |
Year of publication | 2024 |
Journal volume | 48 |
Journal issue | 34 |
Pages of publication | 14904 - 14923 |
a | 8.9565 ± 0.0007 Å |
b | 12.0727 ± 0.0009 Å |
c | 12.5432 ± 0.001 Å |
α | 107.005 ± 0.003° |
β | 105.112 ± 0.003° |
γ | 97.415 ± 0.003° |
Cell volume | 1220.78 ± 0.17 Å3 |
Cell temperature | 300 ± 2 K |
Ambient diffraction temperature | 300 ± 2 K |
Number of distinct elements | 5 |
Space group number | 2 |
Hermann-Mauguin space group symbol | P -1 |
Hall space group symbol | -P 1 |
Residual factor for all reflections | 0.1015 |
Residual factor for significantly intense reflections | 0.0535 |
Weighted residual factors for significantly intense reflections | 0.1355 |
Weighted residual factors for all reflections included in the refinement | 0.1577 |
Goodness-of-fit parameter for all reflections included in the refinement | 1.029 |
Diffraction radiation wavelength | 0.71073 Å |
Diffraction radiation type | MoKα |