Information card for entry 7063408
Formula | C36 H72 N2 O9 V |
Calculated formula | C36 H72 N2 O9 V |
Title of publication | Double complex salts based on tetraamminplatinum(ii) and vanadyl(iv) bisoxalate for the preparation of bimetallic Pt–V alloys |
Authors of publication | Vorobyeva, Sofia N.; Rudzis, Zakhar V.; Sukhikh, Taisiya S.; Filatov, Evgeny Yu.; Plusnin, Pavel E.; Nadolinny, Vladimir A.; Bogomyakov, Artem S.; Korenev, Sergey V. |
Journal of publication | New Journal of Chemistry |
Year of publication | 2024 |
Journal volume | 48 |
Journal issue | 36 |
Pages of publication | 15894 - 15903 |
a | 18.9092 ± 0.0019 Å |
b | 13.9416 ± 0.0012 Å |
c | 18.272 ± 0.003 Å |
α | 90° |
β | 120.899 ± 0.003° |
γ | 90° |
Cell volume | 4133.3 ± 0.9 Å3 |
Cell temperature | 150 ± 2 K |
Ambient diffraction temperature | 150 ± 2 K |
Number of distinct elements | 5 |
Space group number | 15 |
Hermann-Mauguin space group symbol | C 1 2/c 1 |
Hall space group symbol | -C 2yc |
Residual factor for all reflections | 0.0648 |
Residual factor for significantly intense reflections | 0.0449 |
Weighted residual factors for significantly intense reflections | 0.1021 |
Weighted residual factors for all reflections included in the refinement | 0.1156 |
Goodness-of-fit parameter for all reflections included in the refinement | 1.04 |
Diffraction radiation wavelength | 0.71073 Å |
Diffraction radiation type | MoKα |