Information card for entry 7063409
Formula | C18 H36 N O6 V |
Calculated formula | C18 H36 N O6 V |
Title of publication | Double complex salts based on tetraamminplatinum(ii) and vanadyl(iv) bisoxalate for the preparation of bimetallic Pt–V alloys |
Authors of publication | Vorobyeva, Sofia N.; Rudzis, Zakhar V.; Sukhikh, Taisiya S.; Filatov, Evgeny Yu.; Plusnin, Pavel E.; Nadolinny, Vladimir A.; Bogomyakov, Artem S.; Korenev, Sergey V. |
Journal of publication | New Journal of Chemistry |
Year of publication | 2024 |
Journal volume | 48 |
Journal issue | 36 |
Pages of publication | 15894 - 15903 |
a | 8.8694 ± 0.0005 Å |
b | 14.916 ± 0.0006 Å |
c | 16.6499 ± 0.0007 Å |
α | 90° |
β | 103.309 ± 0.002° |
γ | 90° |
Cell volume | 2143.56 ± 0.17 Å3 |
Cell temperature | 150 K |
Ambient diffraction temperature | 150 K |
Number of distinct elements | 5 |
Space group number | 14 |
Hermann-Mauguin space group symbol | P 1 21/n 1 |
Hall space group symbol | -P 2yn |
Residual factor for all reflections | 0.0729 |
Residual factor for significantly intense reflections | 0.0473 |
Weighted residual factors for significantly intense reflections | 0.0951 |
Weighted residual factors for all reflections included in the refinement | 0.1098 |
Goodness-of-fit parameter for all reflections included in the refinement | 1.035 |
Diffraction radiation wavelength | 0.71073 Å |
Diffraction radiation type | MoKα |