Information card for entry 7063411
Formula | C4 H12 N4 O9 Pt V |
Calculated formula | C4 H12 N4 O9 Pt V |
Title of publication | Double complex salts based on tetraamminplatinum(ii) and vanadyl(iv) bisoxalate for the preparation of bimetallic Pt–V alloys |
Authors of publication | Vorobyeva, Sofia N.; Rudzis, Zakhar V.; Sukhikh, Taisiya S.; Filatov, Evgeny Yu.; Plusnin, Pavel E.; Nadolinny, Vladimir A.; Bogomyakov, Artem S.; Korenev, Sergey V. |
Journal of publication | New Journal of Chemistry |
Year of publication | 2024 |
Journal volume | 48 |
Journal issue | 36 |
Pages of publication | 15894 - 15903 |
a | 19.603 ± 0.008 Å |
b | 7.945 ± 0.003 Å |
c | 15.358 ± 0.006 Å |
α | 90° |
β | 97.242 ± 0.013° |
γ | 90° |
Cell volume | 2372.9 ± 1.6 Å3 |
Cell temperature | 150 K |
Ambient diffraction temperature | 150 K |
Number of distinct elements | 6 |
Space group number | 15 |
Hermann-Mauguin space group symbol | C 1 2/c 1 |
Hall space group symbol | -C 2yc |
Residual factor for all reflections | 0.0996 |
Residual factor for significantly intense reflections | 0.0561 |
Weighted residual factors for significantly intense reflections | 0.0987 |
Weighted residual factors for all reflections included in the refinement | 0.119 |
Goodness-of-fit parameter for all reflections included in the refinement | 0.95 |
Diffraction radiation wavelength | 0.71073 Å |
Diffraction radiation type | MoKα |