Information card for entry 7063410
Formula | C4 H18 N4 O12 Pt V |
Calculated formula | C4 H18 N4 O12 Pt V |
Title of publication | Double complex salts based on tetraamminplatinum(ii) and vanadyl(iv) bisoxalate for the preparation of bimetallic Pt–V alloys |
Authors of publication | Vorobyeva, Sofia N.; Rudzis, Zakhar V.; Sukhikh, Taisiya S.; Filatov, Evgeny Yu.; Plusnin, Pavel E.; Nadolinny, Vladimir A.; Bogomyakov, Artem S.; Korenev, Sergey V. |
Journal of publication | New Journal of Chemistry |
Year of publication | 2024 |
Journal volume | 48 |
Journal issue | 36 |
Pages of publication | 15894 - 15903 |
a | 7.2795 ± 0.0001 Å |
b | 8.2434 ± 0.0001 Å |
c | 12.9863 ± 0.0002 Å |
α | 108.135 ± 0.001° |
β | 97.304 ± 0.001° |
γ | 95.743 ± 0.001° |
Cell volume | 726.456 ± 0.018 Å3 |
Cell temperature | 150 K |
Ambient diffraction temperature | 150 K |
Number of distinct elements | 6 |
Space group number | 2 |
Hermann-Mauguin space group symbol | P -1 |
Hall space group symbol | -P 1 |
Residual factor for all reflections | 0.0252 |
Residual factor for significantly intense reflections | 0.0192 |
Weighted residual factors for significantly intense reflections | 0.0414 |
Weighted residual factors for all reflections included in the refinement | 0.0433 |
Goodness-of-fit parameter for all reflections included in the refinement | 1.066 |
Diffraction radiation wavelength | 0.71073 Å |
Diffraction radiation type | MoKα |